Target
E-selectin
Ligand
BDBM50098517
Substrate
Meas. Tech.
ChEMBL_199704 (CHEMBL803587)
IC50
13±n/a nM
Citation
 Stewart, AOBhatia, PAMcCarty, CMPatel, MVStaeger, MAArendsen, DLGunawardana, IWMelcher, LMZhu, GDBoyd, SAFry, DGCool, BLKifle, LLartey, KMarsh, KCKempf-Grote, AJKilgannon, PWisdom, WMeyer, JGallatin, WMOkasinski, GF Discovery of inhibitors of cell adhesion molecule expression in human endothelial cells. 1. Selective inhibition of ICAM-1 and E-selectin expression. J Med Chem 44:988-1002 (2001)  
Target
Name:
E-selectin
Synonyms:
ELAM1 SELE Selectin E
Type:
PROTEIN
Mol. Mass.:
66642.96
Organism:
Homo sapiens (Human)
Description:
ChEMBL_1438995
Residue:
610
  
Inhibitor
Name:
BDBM50098517
Synonyms:
4-(3,4-Dimethyl-phenylsulfanyl)-thieno[2,3-c]pyridine-2-carboxylic acid amide | CHEMBL267125
Type:
Small organic molecule
Emp. Form.:
C16H14N2OS2
Mol. Mass.:
314.425
SMILES:
Cc1ccc(Sc2cncc3sc(cc23)C(N)=O)cc1C
: