Target
5-hydroxytryptamine receptor 2C
Ligand
BDBM50098526
Substrate
Meas. Tech.
ChEMBL_2822 (CHEMBL621508)
Ki
0.25±n/a nM
Citation
 Chambers, JJKurrasch-Orbaugh, DMParker, MANichols, DE Enantiospecific synthesis and pharmacological evaluation of a series of super-potent, conformationally restricted 5-HT(2A/2C) receptor agonists. J Med Chem 44:1003-10 (2001)  
Target
Name:
5-hydroxytryptamine receptor 2C
Synonyms:
5-HT2C 5-hydroxytryptamine receptor 2C (5HT2c) 5ht1c Htr2c Serotonin receptor 2a and 2c (5HT2A and 5HT2C)
Type:
Enzyme
Mol. Mass.:
51935.10
Organism:
Rattus norvegicus (Rat)
Description:
P08909
Residue:
460
  
Inhibitor
Name:
BDBM50098526
Synonyms:
2-(8-Bromo-benzo[1,2-b;4,5-b']difuran-4-yl)-1-methyl-ethyl-ammonium; chloride | CHEMBL263083
Type:
Small organic molecule
Emp. Form.:
C13H13BrNO2
Mol. Mass.:
295.151
SMILES:
C[C@H]([NH3+])Cc1c2ccoc2c(Br)c2ccoc12
: