Target
Cytochrome P450 4B1
Ligand
BDBM368657
Substrate
Meas. Tech.
ChEMBL_1985680 (CHEMBL4619086)
IC50
>25000±n/a nM
Citation
 Perreault, SArjmand, FChandrasekhar, JHao, JKeegan, KSKoditek, DLepist, EIMatson, CKMcGrath, MEPatel, LSedillo, KTherrien, JTill, NATomkinson, ATreiberg, JZherebina, YPhillips, G Discovery of an Atropisomeric PI3K? Selective Inhibitor through Optimization of the Hinge Binding Motif. ACS Med Chem Lett 11:1236-1243 (2020)  
Target
Name:
Cytochrome P450 4B1
Synonyms:
1.14.14.1 CYP4B1 Cytochrome P450 4B1 | Cytochrome P450-HP
Type:
PROTEIN
Mol. Mass.:
59005.59
Organism:
Homo sapiens
Description:
ChEMBL_119703
Residue:
511
  
Inhibitor
Name:
BDBM368657
Synonyms:
US10227350, Compound 105 US10227350, Compound 75
Type:
Small organic molecule
Emp. Form.:
C24H15F3N8
Mol. Mass.:
472.4247
SMILES:
Cc1nc2c(cc(cc2n1-c1ccnc2c(F)ccc(F)c12)-c1ccnc(N)c1F)-c1nnc[nH]1
: