Target
Nonstructural protein 3
Ligand
BDBM50393505
Substrate
Meas. Tech.
ChEMBL_1986304 (CHEMBL4619851)
Kd
9000±n/a nM
Citation
 Voss, SNitsche, C Inhibitors of the Zika virus protease NS2B-NS3. Bioorg Med Chem Lett 30:0 (2020)  
Target
Name:
Nonstructural protein 3
Synonyms:
Genome polyprotein | NS3
Type:
PROTEIN
Mol. Mass.:
7653.58
Organism:
Zika virus
Description:
ChEMBL_119671
Residue:
66
  
Inhibitor
Name:
BDBM50393505
Synonyms:
CHEMBL2158051
Type:
Small organic molecule
Emp. Form.:
C32H43N5O4
Mol. Mass.:
561.7149
SMILES:
CN[C@@H](C)C(=O)N[C@H]1CN(CC[C@H]2CC[C@H](N2C1=O)C(=O)NC(c1ccccc1)c1ccccc1)C(=O)CC(C)C
: