Target
Sortase family protein
Ligand
BDBM50542888
Substrate
Meas. Tech.
ChEMBL_1988077 (CHEMBL4621624)
IC50
1100±n/a nM
Citation
 Yang, TZhang, TGuan, XNDong, ZLan, LYang, SYang, CG Tideglusib and Its Analogues As Inhibitors of  J Med Chem 63:8442-8457 (2020)  
Target
Name:
Sortase family protein
Synonyms:
Sortase | Sortase A (SrtA)
Type:
Enzyme
Mol. Mass.:
23546.15
Organism:
Staphylococcus aureus
Description:
Residue:
206
  
Inhibitor
Name:
BDBM50542888
Synonyms:
CHEMBL4634109
Type:
Small organic molecule
Emp. Form.:
C15H15N3O3S
Mol. Mass.:
317.363
SMILES:
Cc1noc(C)c1-n1sc(=O)n(Cc2ccc(C)cc2)c1=O
: