Target
Sortase family protein
Ligand
BDBM50542879
Substrate
Meas. Tech.
ChEMBL_1988077 (CHEMBL4621624)
IC50
700±n/a nM
Citation
 Yang, TZhang, TGuan, XNDong, ZLan, LYang, SYang, CG Tideglusib and Its Analogues As Inhibitors of  J Med Chem 63:8442-8457 (2020)  
Target
Name:
Sortase family protein
Synonyms:
Sortase | Sortase A (SrtA)
Type:
Enzyme
Mol. Mass.:
23546.15
Organism:
Staphylococcus aureus
Description:
Residue:
206
  
Inhibitor
Name:
BDBM50542879
Synonyms:
CHEMBL4635655
Type:
Small organic molecule
Emp. Form.:
C19H13ClN2O2S
Mol. Mass.:
368.837
SMILES:
Clc1ccc(Cn2c(=O)sn(-c3cccc4ccccc34)c2=O)cc1
: