Target
Alpha-enolase
Ligand
BDBM50543110
Substrate
Meas. Tech.
ChEMBL_1988445 (CHEMBL4621992)
IC50
604±n/a nM
Citation
 Yan, VCYang, KLBallato, ESKhadka, SShrestha, PArthur, KGeorgiou, DKWashington, MTran, TPoral, AHPham, CDYan, MJMuller, FL Bioreducible Phosphonoamidate Pro-drug Inhibitor of Enolase: Proof of Concept Study. ACS Med Chem Lett 11:1484-1489 (2020)  
Target
Name:
Alpha-enolase
Synonyms:
2-phospho-D-glycerate hydro-lyase C-myc promoter-binding protein ENO1L1 Enolase 1 MBP-1 MPB-1 NNE Phosphopyruvate hydratase | Plasminogen-binding protein
Type:
Mol. Mass.:
47171.43
Organism:
Homo sapiens (Human)
Description:
P06733
Residue:
434
  
Inhibitor
Name:
BDBM50543110
Synonyms:
CHEMBL4647008
Type:
Small organic molecule
Emp. Form.:
C17H30NO9P
Mol. Mass.:
423.3952
SMILES:
CC(C)(C)C(=O)OCOP(=O)(OCOC(=O)C(C)(C)C)C1CCCN(O)C1=O
: