Target
Receptor-type tyrosine-protein phosphatase C
Ligand
BDBM50099767
Substrate
Meas. Tech.
ChEMBL_39938 (CHEMBL655779)
IC50
700±n/a nM
Citation
 Urbanek, RASuchard, SJSteelman, GBKnappenberger, KSSygowski, LAVeale, CAChapdelaine, MJ Potent reversible inhibitors of the protein tyrosine phosphatase CD45. J Med Chem 44:1777-93 (2001)  
Target
Name:
Receptor-type tyrosine-protein phosphatase C
Synonyms:
CD45 L-CA PTPRC Receptor-type tyrosine-protein phosphatase C (CD45) | T200
Type:
Protein
Mol. Mass.:
147474.19
Organism:
Homo sapiens (Human)
Description:
P08575
Residue:
1306
  
Inhibitor
Name:
BDBM50099767
Synonyms:
4-(1-{2-[3-Carboxy-1-(carboxymethyl-carbamoyl)-propylcarbamoyl]-pyrrolidine-1-carbonyl}-4-guanidino-butylcarbamoyl)-4-[(9,10-dioxo-9,10-dihydro-phenanthrene-2-carbonyl)-amino]-butyric acid | CHEMBL50793
Type:
Small organic molecule
Emp. Form.:
C38H44N8O13
Mol. Mass.:
820.8018
SMILES:
NC(=N)NCCCC(NC(=O)C(CCC(O)=O)NC(=O)c1ccc2-c3ccccc3C(=O)C(=O)c2c1)C(=O)N1CCCC1C(=O)NC(CCC(O)=O)C(=O)NCC(O)=O
: