Target
Procathepsin L
Ligand
BDBM50099692
Substrate
Meas. Tech.
ChEMBL_48520 (CHEMBL663367)
IC50
500±n/a nM
Citation
 Urbanek, RASuchard, SJSteelman, GBKnappenberger, KSSygowski, LAVeale, CAChapdelaine, MJ Potent reversible inhibitors of the protein tyrosine phosphatase CD45. J Med Chem 44:1777-93 (2001)  
Target
Name:
Procathepsin L
Synonyms:
CATL1_HUMAN CTSL CTSL1 Cathepsin L Cathepsin L1 heavy chain MEP cathepsin L preproprotein
Type:
Enzyme
Mol. Mass.:
37557.19
Organism:
Homo sapiens (Human)
Description:
Purchased from Calbiochem (San Diego, CA).
Residue:
333
  
Inhibitor
Name:
BDBM50099692
Synonyms:
CHEMBL51314 N-(9,10-Dioxo-9,10-dihydro-phenanthrene-2-yl)-2,2-dimethyl-propionamide | N-(9,10-dioxo-9,10-dihydrophenanthren-2-yl)-2,2-dimethylpropionamide
Type:
Small organic molecule
Emp. Form.:
C19H17NO3
Mol. Mass.:
307.3432
SMILES:
CC(C)(C)C(=O)Nc1ccc-2c(c1)C(=O)C(=O)c1ccccc-21
: