Target
Gag-Pol polyprotein [489-587]
Ligand
BDBM50099843
Substrate
Meas. Tech.
ChEBML_157720
Ki
0.001±n/a nM
Citation
 Sham, HLBetebenner, DAHerrin, TKumar, GSaldivar, AVasavanonda, SMolla, AKempf, DJPlattner, JJNorbeck, DW Synthesis and antiviral activities of the major metabolites of the HIV protease inhibitor ABT-378 (Lopinavir). Bioorg Med Chem Lett 11:1351-3 (2001)  
Target
Name:
Gag-Pol polyprotein [489-587]
Synonyms:
Human immunodeficiency virus type 1 protease Pol polyprotein | gag-pol
Type:
Enzyme Subunit
Mol. Mass.:
10781.16
Organism:
Human immunodeficiency virus type 1
Description:
P04585[489-587]
Residue:
99
  
Inhibitor
Name:
BDBM50099843
Synonyms:
(S)-N-[(S)-4-[2-(2,6-Dimethyl-phenoxy)-acetylamino]-3-(S)-hydroxy-5-phenyl-1-((S)-phenylmethyl)-pentyl]-2-(4-hydroxy-2-oxo-tetrahydro-pyrimidin-1-yl)-3-methyl-butyramide | CHEMBL30207
Type:
Small organic molecule
Emp. Form.:
C37H48N4O6
Mol. Mass.:
644.8002
SMILES:
CC(C)[C@H](N1CCC(O)NC1=O)C(=O)N[C@H](C[C@H](O)[C@H](Cc1ccccc1)NC(=O)COc1c(C)cccc1C)Cc1ccccc1
: