Target
Peptide deformylase
Ligand
BDBM50099857
Substrate
Meas. Tech.
ChEBML_154331
IC50
>100000±n/a nM
Citation
 Thorarensen, ADeibel, MRRohrer, DCVosters, AFYem, AWMarshall, VDLynn, JCBohanon, MJTomich, PKZurenko, GESweeney, MTJensen, RMNielsen, JWSeest, EPDolak, LA Identification of novel potent hydroxamic acid inhibitors of peptidyl deformylase and the importance of the hydroxamic acid functionality on inhibition. Bioorg Med Chem Lett 11:1355-8 (2001)  
Target
Name:
Peptide deformylase
Synonyms:
DEF_STAAU Peptide Deformylase def pdf1
Type:
PROTEIN
Mol. Mass.:
20556.80
Organism:
Staphylococcus aureus (strain Mu50 / ATCC 700699)
Description:
ChEMBL_459563
Residue:
183
  
Inhibitor
Name:
BDBM50099857
Synonyms:
ACETOHYDROXAMIC ACID (AHA) Acethydroxamsaeure Acetic acid, oxime Cetohyroxamic acid Methylhydroxamic acid N-Acetylhydroxylamine acetohydroxamic acid
Type:
Small organic molecule
Emp. Form.:
C2H5NO2
Mol. Mass.:
75.0666
SMILES:
CC(=O)NO
: