Target
Serine/threonine-protein kinase B-raf
Ligand
BDBM221688
Substrate
Meas. Tech.
ChEMBL_1989763 (CHEMBL4623498)
IC50
4.0±n/a nM
Citation
 Abdel-Maksoud, MSAli, EMHAmmar, UMMersal, KIYoo, KHOh, CH Design and synthesis of novel pyrrolo[2,3-b]pyridine derivatives targeting  Bioorg Med Chem 28:0 (2020)  
Target
Name:
Serine/threonine-protein kinase B-raf
Synonyms:
B-RAF B-Raf proto-oncogene serine/threonine-protein kinase BRAF1 RAFB1 v-Raf murine sarcoma viral oncogene homolog B1
Type:
Serine/threonine-protein kinase
Mol. Mass.:
84446.00
Organism:
Homo sapiens (Human)
Description:
P15056
Residue:
766
  
Inhibitor
Name:
BDBM221688
Synonyms:
US10568884, Cpd 9 US9593100, Compound 9 | USRE49556, Compound 9
Type:
Small organic molecule
Emp. Form.:
C22H27ClFN7O4S
Mol. Mass.:
540.011
SMILES:
COC(=O)N[C@@H](C)CNc1nccc(n1)-c1cn(nc1-c1cc(Cl)cc(NS(C)(=O)=O)c1F)C(C)C
: