Target
72 kDa type IV collagenase
Ligand
BDBM50100900
Substrate
Meas. Tech.
ChEMBL_101908 (CHEMBL710982)
IC50
37000±n/a nM
Citation
 Michaelides, MRDellaria, JFGong, JHolms, JHBouska, JJStacey, JWada, CKHeyman, HRCurtin, MLGuo, YGoodfellow, CLElmore, IBAlbert, DHMagoc, TJMarcotte, PAMorgan, DWDavidsen, SK Biaryl ether retrohydroxamates as potent, long-lived, orally bioavailable MMP inhibitors. Bioorg Med Chem Lett 11:1553-6 (2001)  
Target
Name:
72 kDa type IV collagenase
Synonyms:
72 kDa gelatinase CLG4A Gelatinase A (MMP-2) MMP2_HUMAN Matrix metalloproteinase-2 (MMP 2) Matrix metalloproteinases 2 (MMP-2) | TBE-1
Type:
Enzyme
Mol. Mass.:
73870.36
Organism:
Homo sapiens (Human)
Description:
P08253
Residue:
660
  
Inhibitor
Name:
BDBM50100900
Synonyms:
CHEMBL38717 | N-[1-(4'-Cyano-biphenyl-4-yloxymethyl)-2-(1,3-dioxo-1,3-dihydro-isoindol-2-yl)-ethyl]-N-hydroxy-formamide
Type:
Small organic molecule
Emp. Form.:
C25H19N3O5
Mol. Mass.:
441.4355
SMILES:
ON(C=O)C(COc1ccc(cc1)-c1ccc(cc1)C#N)CN1C(=O)c2ccccc2C1=O
: