Target
72 kDa type IV collagenase
Ligand
BDBM50096645
Substrate
Meas. Tech.
ChEBML_101908
IC50
32±n/a nM
Citation
 Michaelides, MRDellaria, JFGong, JHolms, JHBouska, JJStacey, JWada, CKHeyman, HRCurtin, MLGuo, YGoodfellow, CLElmore, IBAlbert, DHMagoc, TJMarcotte, PAMorgan, DWDavidsen, SK Biaryl ether retrohydroxamates as potent, long-lived, orally bioavailable MMP inhibitors. Bioorg Med Chem Lett 11:1553-6 (2001)  
Target
Name:
72 kDa type IV collagenase
Synonyms:
72 kDa gelatinase CLG4A Gelatinase A (MMP-2) MMP2_HUMAN Matrix metalloproteinase-2 (MMP 2) Matrix metalloproteinases 2 (MMP-2) | TBE-1
Type:
Enzyme
Mol. Mass.:
73870.36
Organism:
Homo sapiens (Human)
Description:
P08253
Residue:
660
  
Inhibitor
Name:
BDBM50096645
Synonyms:
3-(4'-Cyano-biphenyl-4-yloxy)-N-hydroxy-propionamide 3-[(4'-cyanobiphenyl-4-yl)oxy]-N-hydroxypropanamide | CHEMBL38851
Type:
Small organic molecule
Emp. Form.:
C16H14N2O3
Mol. Mass.:
282.294
SMILES:
ONC(=O)CCOc1ccc(cc1)-c1ccc(cc1)C#N
: