Target
Stromelysin-1
Ligand
BDBM50100905
Substrate
Meas. Tech.
ChEBML_104731
IC50
35000±n/a nM
Citation
 Michaelides, MRDellaria, JFGong, JHolms, JHBouska, JJStacey, JWada, CKHeyman, HRCurtin, MLGuo, YGoodfellow, CLElmore, IBAlbert, DHMagoc, TJMarcotte, PAMorgan, DWDavidsen, SK Biaryl ether retrohydroxamates as potent, long-lived, orally bioavailable MMP inhibitors. Bioorg Med Chem Lett 11:1553-6 (2001)  
Target
Name:
Stromelysin-1
Synonyms:
MMP-3 MMP3_HUMAN Matrix metalloproteinase 3 Matrix metalloproteinase-3 (MMP-3) SL-1 Stromelysin 1 | Transin-1
Type:
Enzyme
Mol. Mass.:
53973.13
Organism:
Homo sapiens (Human)
Description:
P08254
Residue:
477
  
Inhibitor
Name:
BDBM50100905
Synonyms:
CHEMBL288510 | N-[1-(4'-Cyano-biphenyl-4-yloxymethyl)-3-(4,4-dimethyl-2,5-dioxo-imidazolidin-1-yl)-propyl]-N-hydroxy-formamide
Type:
Small organic molecule
Emp. Form.:
C23H24N4O5
Mol. Mass.:
436.4605
SMILES:
CC1(C)NC(=O)N(CCC(COc2ccc(cc2)-c2ccc(cc2)C#N)N(O)C=O)C1=O
: