Target
Stromelysin-1
Ligand
BDBM50100915
Substrate
Meas. Tech.
ChEBML_104731
IC50
11000±n/a nM
Citation
 Michaelides, MRDellaria, JFGong, JHolms, JHBouska, JJStacey, JWada, CKHeyman, HRCurtin, MLGuo, YGoodfellow, CLElmore, IBAlbert, DHMagoc, TJMarcotte, PAMorgan, DWDavidsen, SK Biaryl ether retrohydroxamates as potent, long-lived, orally bioavailable MMP inhibitors. Bioorg Med Chem Lett 11:1553-6 (2001)  
Target
Name:
Stromelysin-1
Synonyms:
MMP-3 MMP3_HUMAN Matrix metalloproteinase 3 Matrix metalloproteinase-3 (MMP-3) SL-1 Stromelysin 1 | Transin-1
Type:
Enzyme
Mol. Mass.:
53973.13
Organism:
Homo sapiens (Human)
Description:
P08254
Residue:
477
  
Inhibitor
Name:
BDBM50100915
Synonyms:
CHEMBL434204 | N-[1-(4'-Cyano-biphenyl-4-yloxymethyl)-2-(2,5-dioxo-pyrrolidin-1-yl)-ethyl]-N-hydroxy-formamide
Type:
Small organic molecule
Emp. Form.:
C21H19N3O5
Mol. Mass.:
393.3927
SMILES:
ON(C=O)C(COc1ccc(cc1)-c1ccc(cc1)C#N)CN1C(=O)CCC1=O
: