Target
72 kDa type IV collagenase
Ligand
BDBM50100917
Substrate
Meas. Tech.
ChEMBL_101908 (CHEMBL710982)
IC50
12000±n/a nM
Citation
 Michaelides, MRDellaria, JFGong, JHolms, JHBouska, JJStacey, JWada, CKHeyman, HRCurtin, MLGuo, YGoodfellow, CLElmore, IBAlbert, DHMagoc, TJMarcotte, PAMorgan, DWDavidsen, SK Biaryl ether retrohydroxamates as potent, long-lived, orally bioavailable MMP inhibitors. Bioorg Med Chem Lett 11:1553-6 (2001)  
Target
Name:
72 kDa type IV collagenase
Synonyms:
72 kDa gelatinase CLG4A Gelatinase A (MMP-2) MMP2_HUMAN Matrix metalloproteinase-2 (MMP 2) Matrix metalloproteinases 2 (MMP-2) | TBE-1
Type:
Enzyme
Mol. Mass.:
73870.36
Organism:
Homo sapiens (Human)
Description:
P08253
Residue:
660
  
Inhibitor
Name:
BDBM50100917
Synonyms:
CHEMBL288592 | N-[1-(4'-Cyano-biphenyl-4-yloxymethyl)-2-(3-ethyl-4,4-dimethyl-2,5-dioxo-imidazolidin-1-yl)-ethyl]-N-hydroxy-formamide
Type:
Small organic molecule
Emp. Form.:
C24H26N4O5
Mol. Mass.:
450.487
SMILES:
CCN1C(=O)N(CC(COc2ccc(cc2)-c2ccc(cc2)C#N)N(O)C=O)C(=O)C1(C)C
: