Target
Stromelysin-1
Ligand
BDBM50100906
Substrate
Meas. Tech.
ChEBML_104731
IC50
300000±n/a nM
Citation
 Michaelides, MRDellaria, JFGong, JHolms, JHBouska, JJStacey, JWada, CKHeyman, HRCurtin, MLGuo, YGoodfellow, CLElmore, IBAlbert, DHMagoc, TJMarcotte, PAMorgan, DWDavidsen, SK Biaryl ether retrohydroxamates as potent, long-lived, orally bioavailable MMP inhibitors. Bioorg Med Chem Lett 11:1553-6 (2001)  
Target
Name:
Stromelysin-1
Synonyms:
MMP-3 MMP3_HUMAN Matrix metalloproteinase 3 Matrix metalloproteinase-3 (MMP-3) SL-1 Stromelysin 1 | Transin-1
Type:
Enzyme
Mol. Mass.:
53973.13
Organism:
Homo sapiens (Human)
Description:
P08254
Residue:
477
  
Inhibitor
Name:
BDBM50100906
Synonyms:
CHEMBL39035 | N-[2-(4'-Cyano-biphenyl-4-yloxy)-1-(4-fluoro-phenyl)-ethyl]-N-hydroxy-formamide
Type:
Small organic molecule
Emp. Form.:
C22H17FN2O3
Mol. Mass.:
376.3804
SMILES:
ON(C=O)C(COc1ccc(cc1)-c1ccc(cc1)C#N)c1ccc(F)cc1
: