Target
Kappa-type opioid receptor
Ligand
BDBM50101612
Substrate
Meas. Tech.
ChEMBL_147230 (CHEMBL754918)
IC50
65±n/a nM
Citation
 Pagé, DNaismith, ASchmidt, RCoupal, MLabarre, MGosselin, MBellemare, DPayza, KBrown, W Novel C-terminus modifications of the Dmt-Tic motif: a new class of dipeptide analogues showing altered pharmacological profiles toward the opioid receptors. J Med Chem 44:2387-90 (2001)  
Target
Name:
Kappa-type opioid receptor
Synonyms:
K-OR-1 Kappa-opioid receptor (KOR) Kappa-type opioid receptor (KOR) OPIATE Kappa OPRK1 kappa opioid receptor (KOR)
Type:
G Protein-Coupled Receptor (GPCR)
Mol. Mass.:
42648.76
Organism:
Homo sapiens (Human)
Description:
P41145
Residue:
380
  
Inhibitor
Name:
BDBM50101612
Synonyms:
2-Amino-1-(3-benzyloxymethyl-3,4-dihydro-1H-isoquinolin-2-yl)-3-(4-hydroxy-2,6-dimethyl-phenyl)-propan-1-one | CHEMBL76089
Type:
Small organic molecule
Emp. Form.:
C28H32N2O3
Mol. Mass.:
444.5653
SMILES:
Cc1cc(O)cc(C)c1C[C@H](N)C(=O)N1Cc2ccccc2C[C@H]1COCc1ccccc1
: