Target
Mu-type opioid receptor
Ligand
BDBM50101617
Substrate
Meas. Tech.
ChEMBL_149485 (CHEMBL758076)
IC50
1.1±n/a nM
Citation
 Pagé, DNaismith, ASchmidt, RCoupal, MLabarre, MGosselin, MBellemare, DPayza, KBrown, W Novel C-terminus modifications of the Dmt-Tic motif: a new class of dipeptide analogues showing altered pharmacological profiles toward the opioid receptors. J Med Chem 44:2387-90 (2001)  
Target
Name:
Mu-type opioid receptor
Synonyms:
M-OR-1 MOR-1 MUOR1 Mu opiate receptor OPRM1 hMOP | mu-type opioid receptor isoform MOR-1
Type:
G Protein-Coupled Receptor (GPCR)
Mol. Mass.:
44789.51
Organism:
Homo sapiens (Human)
Description:
P35372
Residue:
400
  
Inhibitor
Name:
BDBM50101617
Synonyms:
1-Adamantan-1-yl-3-{2-[2-amino-3-(4-hydroxy-2,6-dimethyl-phenyl)-propionyl]-1,2,3,4-tetrahydro-isoquinolin-3-ylmethyl}-urea | CHEMBL77804
Type:
Small organic molecule
Emp. Form.:
C32H42N4O3
Mol. Mass.:
530.7009
SMILES:
Cc1cc(O)cc(C)c1C[C@H](N)C(=O)N1Cc2ccccc2C[C@H]1CNC(=O)NC12CC3CC(CC(C3)C1)C2
: