Target
Mu-type opioid receptor
Ligand
BDBM50101626
Substrate
Meas. Tech.
ChEMBL_149485 (CHEMBL758076)
IC50
13±n/a nM
Citation
 Pagé, DNaismith, ASchmidt, RCoupal, MLabarre, MGosselin, MBellemare, DPayza, KBrown, W Novel C-terminus modifications of the Dmt-Tic motif: a new class of dipeptide analogues showing altered pharmacological profiles toward the opioid receptors. J Med Chem 44:2387-90 (2001)  
Target
Name:
Mu-type opioid receptor
Synonyms:
M-OR-1 MOR-1 MUOR1 Mu opiate receptor OPRM1 hMOP | mu-type opioid receptor isoform MOR-1
Type:
G Protein-Coupled Receptor (GPCR)
Mol. Mass.:
44789.51
Organism:
Homo sapiens (Human)
Description:
P35372
Residue:
400
  
Inhibitor
Name:
BDBM50101626
Synonyms:
CHEMBL309236 | N-{2-[2-Amino-3-(4-hydroxy-2,6-dimethyl-phenyl)-propionyl]-1,2,3,4-tetrahydro-isoquinolin-3-ylmethyl}-guanidine
Type:
Small organic molecule
Emp. Form.:
C22H29N5O2
Mol. Mass.:
395.498
SMILES:
[#6]-c1cc(-[#8])cc(-[#6])c1-[#6]-[#6@H](-[#7])-[#6](=O)-[#7]-1-[#6]-c2ccccc2-[#6]-[#6@H]-1-[#6]\[#7]=[#6](/[#7])-[#7]
: