Target
Mu-type opioid receptor
Ligand
BDBM50101614
Substrate
Meas. Tech.
ChEMBL_149485 (CHEMBL758076)
IC50
36±n/a nM
Citation
 Pagé, DNaismith, ASchmidt, RCoupal, MLabarre, MGosselin, MBellemare, DPayza, KBrown, W Novel C-terminus modifications of the Dmt-Tic motif: a new class of dipeptide analogues showing altered pharmacological profiles toward the opioid receptors. J Med Chem 44:2387-90 (2001)  
Target
Name:
Mu-type opioid receptor
Synonyms:
M-OR-1 MOR-1 MUOR1 Mu opiate receptor OPRM1 hMOP | mu-type opioid receptor isoform MOR-1
Type:
G Protein-Coupled Receptor (GPCR)
Mol. Mass.:
44789.51
Organism:
Homo sapiens (Human)
Description:
P35372
Residue:
400
  
Inhibitor
Name:
BDBM50101614
Synonyms:
1-{2-[2-Amino-3-(4-hydroxy-2,6-dimethyl-phenyl)-propionyl]-1,2,3,4-tetrahydro-isoquinolin-3-ylmethyl}-3-tert-butyl-thiourea | CHEMBL421520
Type:
Small organic molecule
Emp. Form.:
C26H36N4O2S
Mol. Mass.:
468.655
SMILES:
Cc1cc(O)cc(C)c1C[C@H](N)C(=O)N1Cc2ccccc2C[C@H]1CNC(=S)NC(C)(C)C
: