Target
Interleukin-1 receptor-associated kinase 3
Ligand
BDBM210300
Substrate
Meas. Tech.
ChEMBL_1991911 (CHEMBL4625646)
IC50
760±n/a nM
Citation
 Nair, SKumar, SRPaidi, VRSistla, RKantheti, DPolimera, SRThangavel, SMukherjee, AJDas, MBhide, RSPitts, WJMurugesan, NDudhgoankar, SNagar, JSubramani, SMazumder, DCarman, JAHolloway, DALi, XFereshteh, MPRuepp, SPalanisamy, KMariappan, TTMaddi, SSaxena, AElzinga, PChimalakonda, ARuan, QGhosh, KBose, SSack, JYan, CKiefer, SEXie, DNewitt, JASaravanakumar, SPRampulla, RABarrish, JCCarter, PHHynes, J Optimization of Nicotinamides as Potent and Selective IRAK4 Inhibitors with Efficacy in a Murine Model of Psoriasis. ACS Med Chem Lett 11:1402-1409 (2020)  
Target
Name:
Interleukin-1 receptor-associated kinase 3
Synonyms:
IL-1 receptor-associated kinase M IRAK-M IRAK3_HUMAN
Type:
PROTEIN
Mol. Mass.:
67767.98
Organism:
Homo sapiens (Human)
Description:
EBI_101055
Residue:
596
  
Inhibitor
Name:
BDBM210300
Synonyms:
US9546153, ex. 367
Type:
Small organic molecule
Emp. Form.:
C20H25F2N7O2
Mol. Mass.:
433.455
SMILES:
CC(C)Nc1cc(Nc2nc3ccnn3cc2F)ncc1C(=O)NC[C@@H](F)C(C)(C)O
: