Target
TYR_PHOSPHATASE_2 domain-containing protein
Ligand
BDBM50544441
Substrate
Meas. Tech.
ChEMBL_1992587 (CHEMBL4626322)
IC50
21±n/a nM
Citation
 Ruddraraju, KVAggarwal, DNiu, CBaker, EAZhang, RYWu, LZhang, ZY Highly Potent and Selective  J Med Chem 63:9212-9227 (2020)  
Target
Name:
TYR_PHOSPHATASE_2 domain-containing protein
Synonyms:
(PROTEIN-TYROSINE-PHOSPHATASE) (PTPase) PHOSPHOTYROSINE PROTEIN PHOSPHATASE PTPB Phosphotyrosine-protein phosphatase PTPB | Protein Tyrosine Phosphatase PTPB
Type:
Hydrolase
Mol. Mass.:
30152.45
Organism:
Mycobacterium tuberculosis
Description:
Residue:
276
  
Inhibitor
Name:
BDBM50544441
Synonyms:
CHEMBL4637373 | US11192850, Entry 4u
Type:
Small organic molecule
Emp. Form.:
C17H9BrF3NO3
Mol. Mass.:
412.157
SMILES:
OC(=O)C(=O)Nc1ccc(cc1)C#Cc1ccc(cc1Br)C(F)(F)F
: