Target
Laforin
Ligand
BDBM50544440
Substrate
Meas. Tech.
ChEMBL_1992567 (CHEMBL4626302)
IC50
>30000±n/a nM
Citation
 Ruddraraju, KVAggarwal, DNiu, CBaker, EAZhang, RYWu, LZhang, ZY Highly Potent and Selective  J Med Chem 63:9212-9227 (2020)  
Target
Name:
Laforin
Synonyms:
EPM2A LAFPTPase Laforin
Type:
Protein
Mol. Mass.:
37158.16
Organism:
Homo sapiens (Human)
Description:
O95278
Residue:
331
  
Inhibitor
Name:
BDBM50544440
Synonyms:
CHEMBL4647367 | US11192850, Entry 4t
Type:
Small organic molecule
Emp. Form.:
C17H9ClF3NO3
Mol. Mass.:
367.706
SMILES:
OC(=O)C(=O)Nc1ccc(cc1)C#Cc1ccc(cc1Cl)C(F)(F)F
: