Target
Dual specificity protein phosphatase CDC14A
Ligand
BDBM50544427
Substrate
Meas. Tech.
ChEMBL_1992575 (CHEMBL4626310)
IC50
>50000±n/a nM
Citation
 Ruddraraju, KVAggarwal, DNiu, CBaker, EAZhang, RYWu, LZhang, ZY Highly Potent and Selective  J Med Chem 63:9212-9227 (2020)  
Target
Name:
Dual specificity protein phosphatase CDC14A
Synonyms:
3.1.3.16 CC14A_HUMAN CDC14A
Type:
Mol. Mass.:
66598.40
Organism:
Homo sapiens (Human)
Description:
Q9UNH5
Residue:
594
  
Inhibitor
Name:
BDBM50544427
Synonyms:
CHEMBL4632818 | US11192850, Entry 4g
Type:
Small organic molecule
Emp. Form.:
C19H16N2O6
Mol. Mass.:
368.3401
SMILES:
CN(C)c1cc(O)c(cc1C#Cc1cccc(NC(=O)C(O)=O)c1)C(O)=O
: