Target
Dual specificity protein phosphatase CDC14A
Ligand
BDBM50544431
Substrate
Meas. Tech.
ChEMBL_1992575 (CHEMBL4626310)
IC50
>30000±n/a nM
Citation
 Ruddraraju, KVAggarwal, DNiu, CBaker, EAZhang, RYWu, LZhang, ZY Highly Potent and Selective  J Med Chem 63:9212-9227 (2020)  
Target
Name:
Dual specificity protein phosphatase CDC14A
Synonyms:
3.1.3.16 CC14A_HUMAN CDC14A
Type:
Mol. Mass.:
66598.40
Organism:
Homo sapiens (Human)
Description:
Q9UNH5
Residue:
594
  
Inhibitor
Name:
BDBM50544431
Synonyms:
CHEMBL4637459 | US11192850, Entry 4k
Type:
Small organic molecule
Emp. Form.:
C17H10F3NO3
Mol. Mass.:
333.2614
SMILES:
OC(=O)C(=O)Nc1ccc(cc1)C#Cc1ccc(cc1)C(F)(F)F
: