Target
Receptor-type tyrosine-protein phosphatase mu
Ligand
BDBM50544427
Substrate
Meas. Tech.
ChEMBL_1992581 (CHEMBL4626316)
IC50
>50000±n/a nM
Citation
 Ruddraraju, KVAggarwal, DNiu, CBaker, EAZhang, RYWu, LZhang, ZY Highly Potent and Selective  J Med Chem 63:9212-9227 (2020)  
Target
Name:
Receptor-type tyrosine-protein phosphatase mu
Synonyms:
PTPRL1 PTPRM_HUMAN Receptor-type tyrosine-protein phosphatase mu | Receptor-type tyrosine-protein phosphatase mu (PTPμ)
Type:
Protein
Mol. Mass.:
163683.56
Organism:
Homo sapiens (Human)
Description:
P28827
Residue:
1452
  
Inhibitor
Name:
BDBM50544427
Synonyms:
CHEMBL4632818 | US11192850, Entry 4g
Type:
Small organic molecule
Emp. Form.:
C19H16N2O6
Mol. Mass.:
368.3401
SMILES:
CN(C)c1cc(O)c(cc1C#Cc1cccc(NC(=O)C(O)=O)c1)C(O)=O
: