Target
Receptor-type tyrosine-protein phosphatase mu
Ligand
BDBM50544431
Substrate
Meas. Tech.
ChEMBL_1992581 (CHEMBL4626316)
IC50
>30000±n/a nM
Citation
 Ruddraraju, KVAggarwal, DNiu, CBaker, EAZhang, RYWu, LZhang, ZY Highly Potent and Selective  J Med Chem 63:9212-9227 (2020)  
Target
Name:
Receptor-type tyrosine-protein phosphatase mu
Synonyms:
PTPRL1 PTPRM_HUMAN Receptor-type tyrosine-protein phosphatase mu | Receptor-type tyrosine-protein phosphatase mu (PTPμ)
Type:
Protein
Mol. Mass.:
163683.56
Organism:
Homo sapiens (Human)
Description:
P28827
Residue:
1452
  
Inhibitor
Name:
BDBM50544431
Synonyms:
CHEMBL4637459 | US11192850, Entry 4k
Type:
Small organic molecule
Emp. Form.:
C17H10F3NO3
Mol. Mass.:
333.2614
SMILES:
OC(=O)C(=O)Nc1ccc(cc1)C#Cc1ccc(cc1)C(F)(F)F
: