Target
Integrin alpha-V/beta-3
Ligand
BDBM50101759
Substrate
Meas. Tech.
ChEMBL_214621 (CHEMBL819701)
IC50
12±n/a nM
Citation
 Peyman, AScheunemann, KWill, DWKnolle, JWehner, VBreipohl, GStilz, HUCarniato, DRuxer, JGourvest, JAuberval, MDoucet, BBaron, RGaillard, MGadek, TRBodary, S alpha(v)beta(3) Antagonists based on a central thiophene scaffold. Bioorg Med Chem Lett 11:2011-5 (2001)  
Target
Name:
Integrin alpha-V/beta-3
Synonyms:
ITGAV/ITGB3 | Integrin beta-3/Vitronectin receptor alpha
Type:
Enzyme
Mol. Mass.:
Description:
Components:
This complex has 2 components.
Component 1
Name:
Integrin alpha-V
Synonyms:
ITAV_HUMAN Integrin alpha-V/alpha-5 VNRA Vitronectin receptor | Vitronectin receptor subunit alpha
Type:
PROTEIN
Mol. Mass.:
116024.92
Organism:
Homo sapiens (Human)
Description:
ChEMBL_582336
Residue:
1048
  
Component 2
Name:
Integrin beta-3
Synonyms:
CD_antigen=CD61 GPIIIa ITGB3 Platelet membrane glycoprotein IIIa
Type:
Protein
Mol. Mass.:
87038.91
Organism:
Homo sapiens (Human)
Description:
P05106
Residue:
788
  
Inhibitor
Name:
BDBM50101759
Synonyms:
(S)-2-(4-Chloro-benzenesulfonylamino)-3-({5-[2-(1,4,5,6-tetrahydro-pyrimidin-2-ylcarbamoyl)-ethyl]-thiophene-2-carbonyl}-amino)-propionic acid | CHEMBL62161
Type:
Small organic molecule
Emp. Form.:
C21H24ClN5O6S2
Mol. Mass.:
542.028
SMILES:
OC(=O)[C@H](CNC(=O)c1ccc(CCC(=O)NC2=NCCCN2)s1)NS(=O)(=O)c1ccc(Cl)cc1
: