Target
Integrin alpha-V/beta-3
Ligand
BDBM50101758
Substrate
Meas. Tech.
ChEMBL_214766 (CHEMBL816224)
IC50
16±n/a nM
Citation
 Peyman, AScheunemann, KWill, DWKnolle, JWehner, VBreipohl, GStilz, HUCarniato, DRuxer, JGourvest, JAuberval, MDoucet, BBaron, RGaillard, MGadek, TRBodary, S alpha(v)beta(3) Antagonists based on a central thiophene scaffold. Bioorg Med Chem Lett 11:2011-5 (2001)  
Target
Name:
Integrin alpha-V/beta-3
Synonyms:
ITGAV/ITGB3 | Integrin beta-3/Vitronectin receptor alpha
Type:
Enzyme
Mol. Mass.:
Description:
Components:
This complex has 2 components.
Component 1
Name:
Integrin alpha-V
Synonyms:
ITAV_HUMAN Integrin alpha-V/alpha-5 VNRA Vitronectin receptor | Vitronectin receptor subunit alpha
Type:
PROTEIN
Mol. Mass.:
116024.92
Organism:
Homo sapiens (Human)
Description:
ChEMBL_582336
Residue:
1048
  
Component 2
Name:
Integrin beta-3
Synonyms:
CD_antigen=CD61 GPIIIa ITGB3 Platelet membrane glycoprotein IIIa
Type:
Protein
Mol. Mass.:
87038.91
Organism:
Homo sapiens (Human)
Description:
P05106
Residue:
788
  
Inhibitor
Name:
BDBM50101758
Synonyms:
3-Benzo[1,3]dioxol-5-yl-3-{[5-(2-guanidinocarbonyl-cyclopropyl)-thiophene-2-carbonyl]-amino}-propionic acid | CHEMBL64179
Type:
Small organic molecule
Emp. Form.:
C23H24N4O6S
Mol. Mass.:
484.525
SMILES:
OC(=O)CC(NC(=O)c1ccc(s1)C1CC1C(=O)NC1=NCCCN1)c1ccc2OCOc2c1
: