Target
Integrin alpha-V/beta-3
Ligand
BDBM50101777
Substrate
Meas. Tech.
ChEMBL_214766 (CHEMBL816224)
IC50
39±n/a nM
Citation
 Peyman, AScheunemann, KWill, DWKnolle, JWehner, VBreipohl, GStilz, HUCarniato, DRuxer, JGourvest, JAuberval, MDoucet, BBaron, RGaillard, MGadek, TRBodary, S alpha(v)beta(3) Antagonists based on a central thiophene scaffold. Bioorg Med Chem Lett 11:2011-5 (2001)  
Target
Name:
Integrin alpha-V/beta-3
Synonyms:
ITGAV/ITGB3 | Integrin beta-3/Vitronectin receptor alpha
Type:
Enzyme
Mol. Mass.:
Description:
Components:
This complex has 2 components.
Component 1
Name:
Integrin alpha-V
Synonyms:
ITAV_HUMAN Integrin alpha-V/alpha-5 VNRA Vitronectin receptor | Vitronectin receptor subunit alpha
Type:
PROTEIN
Mol. Mass.:
116024.92
Organism:
Homo sapiens (Human)
Description:
ChEMBL_582336
Residue:
1048
  
Component 2
Name:
Integrin beta-3
Synonyms:
CD_antigen=CD61 GPIIIa ITGB3 Platelet membrane glycoprotein IIIa
Type:
Protein
Mol. Mass.:
87038.91
Organism:
Homo sapiens (Human)
Description:
P05106
Residue:
788
  
Inhibitor
Name:
BDBM50101777
Synonyms:
(2S)-2-{[(benzyloxy)carbonyl]amino}-3-({5-[2-(carbamimidoylcarbamoyl)ethyl]thiophen-2-yl}formamido)propanoic acid | CHEMBL431724
Type:
Small organic molecule
Emp. Form.:
C20H23N5O6S
Mol. Mass.:
461.492
SMILES:
NC(=N)NC(=O)CCc1ccc(s1)C(=O)NC[C@H](NC(=O)OCc1ccccc1)C(O)=O
: