Target
Prostaglandin E2 receptor EP3 subtype
Ligand
BDBM50101827
Substrate
Meas. Tech.
ChEBML_158323
Ki
>0.000100±n/a nM
Citation
 Tani, KNaganawa, AIshida, AEgashira, HSagawa, KHarada, HOgawa, MMaruyama, TOhuchida, SNakai, HKondo, KToda, M Design and synthesis of a highly selective EP2-receptor agonist. Bioorg Med Chem Lett 11:2025-8 (2001)  
Target
Name:
Prostaglandin E2 receptor EP3 subtype
Synonyms:
PE2R3_MOUSE Prostaglandin E2 receptor EP3 isoform alpha Prostanoid EP3 receptor Ptgerep3
Type:
G-protein coupled receptor
Mol. Mass.:
40092.50
Organism:
Mus musculus (Mouse)
Description:
Residue:
365
  
Inhibitor
Name:
BDBM50101827
Synonyms:
(Z)-7-{(1R,2R,3R)-2-[(E)-(S)-4-(1-Ethyl-cyclobutyl)-4-hydroxy-but-1-enyl]-3-hydroxy-5-oxo-cyclopentyl}-hept-5-enoic acid | CHEMBL64483
Type:
Small organic molecule
Emp. Form.:
C22H34O5
Mol. Mass.:
378.5024
SMILES:
CCC1(CCC1)[C@@H](O)C\C=C\[C@H]1[C@H](O)CC(=O)[C@@H]1C\C=C/CCCC(O)=O
: