Target
Prostaglandin E2 receptor EP2 subtype
Ligand
BDBM50101819
Substrate
Meas. Tech.
ChEBML_158309
Ki
43±n/a nM
Citation
 Tani, KNaganawa, AIshida, AEgashira, HSagawa, KHarada, HOgawa, MMaruyama, TOhuchida, SNakai, HKondo, KToda, M Design and synthesis of a highly selective EP2-receptor agonist. Bioorg Med Chem Lett 11:2025-8 (2001)  
Target
Name:
Prostaglandin E2 receptor EP2 subtype
Synonyms:
PE2R2_MOUSE Prostaglandin E2 Prostanoid EP2 receptor Ptgerep2
Type:
G-protein coupled receptor
Mol. Mass.:
40495.26
Organism:
Mus musculus (Mouse)
Description:
Residue:
362
  
Inhibitor
Name:
BDBM50101819
Synonyms:
(Z)-7-{(1R,2R,3R)-2-[(E)-(S)-4-(1-Butyl-cyclobutyl)-4-hydroxy-but-1-enyl]-3-hydroxy-5-oxo-cyclopentyl}-hept-5-enoic acid | CHEMBL303763
Type:
Small organic molecule
Emp. Form.:
C24H38O5
Mol. Mass.:
406.5555
SMILES:
CCCCC1(CCC1)[C@@H](O)C\C=C\[C@H]1[C@H](O)CC(=O)[C@@H]1C\C=C/CCCC(O)=O
: