Target
Prostacyclin receptor
Ligand
BDBM50101853
Substrate
Meas. Tech.
ChEMBL_158461 (CHEMBL763264)
EC50
1.8±n/a nM
Citation
 Tani, KNaganawa, AIshida, AEgashira, HSagawa, KHarada, HOgawa, MMaruyama, TOhuchida, SNakai, HKondo, KToda, M Design and synthesis of a highly selective EP2-receptor agonist. Bioorg Med Chem Lett 11:2025-8 (2001)  
Target
Name:
Prostacyclin receptor
Synonyms:
PGI receptor PRIPR Prostacyclin (IP) Receptor Prostaglandin I Prostaglandin I2 receptor | Prostanoid IP receptor
Type:
G Protein-Coupled Receptor (GPCR)
Mol. Mass.:
40968.22
Organism:
Homo sapiens (Human)
Description:
The membranes prepared from human platelet were used in binding assay.
Residue:
386
  
Inhibitor
Name:
BDBM50101853
Synonyms:
(11alpha,13E,15S)-11,15-dihydroxy-9-oxoprost-13-en-1-oic acid 11alpha,15alpha-dihydroxy-9-oxo-13-trans-prostenoic acid CHEMBL495 PGE1 | prostaglandin E1
Type:
Small organic molecule
Emp. Form.:
C20H34O5
Mol. Mass.:
354.481
SMILES:
CCCCC[C@H](O)\C=C\[C@H]1[C@H](O)CC(=O)[C@@H]1CCCCCCC(O)=O
: