Target
Prostaglandin E2 receptor EP4 subtype
Ligand
BDBM50101838
Substrate
Meas. Tech.
ChEBML_158450
EC50
32±n/a nM
Citation
 Maruyama, TAsada, MShiraishi, TIshida, AEgashira, HYoshida, HMaruyama, TOhuchida, SNakai, HKondo, KToda, M Design and synthesis of a highly selective EP4-receptor agonist. Part 1: 3,7-dithiaPG derivatives with high selectivity. Bioorg Med Chem Lett 11:2029-31 (2001)  
Target
Name:
Prostaglandin E2 receptor EP4 subtype
Synonyms:
PE2R4_MOUSE Prostanoid EP4 receptor Ptgerep4
Type:
G-protein coupled receptor
Mol. Mass.:
56175.66
Organism:
Mus musculus (Mouse)
Description:
Residue:
513
  
Inhibitor
Name:
BDBM50101838
Synonyms:
(3-{(1R,2S,3R)-3-Hydroxy-2-[(E)-(S)-3-hydroxy-4-(4-methoxy-phenyl)-but-1-enyl]-5-oxo-cyclopentylsulfanyl}-propylsulfanyl)-acetic acid | CHEMBL305126
Type:
Small organic molecule
Emp. Form.:
C21H28O6S2
Mol. Mass.:
440.573
SMILES:
COc1ccc(C[C@H](O)\C=C\[C@H]2[C@H](O)CC(=O)[C@@H]2SCCCSCC(O)=O)cc1
: