Target
5-hydroxytryptamine receptor 2A/Metabotropic glutamate receptor 2
Ligand
BDBM50544628
Substrate
Meas. Tech.
ChEMBL_1993275 (CHEMBL4627010)
EC50
<50119±n/a nM
Citation
 Poulie, CBMLiu, NJensen, AABunch, L Design, Synthesis, and Pharmacological Characterization of Heterobivalent Ligands for the Putative 5-HT J Med Chem 63:9928-9949 (2020)  
Target
Name:
5-hydroxytryptamine receptor 2A/Metabotropic glutamate receptor 2
Synonyms:
Type:
Mol. Mass.:
Description:
ASSAY_ID of ChEMBL is 1993275
Components:
This complex has 2 components.
Component 1
Name:
5-hydroxytryptamine receptor 2A
Synonyms:
5-HT-2 5-HT2A 5-hydroxytryptamine receptor 2A (5HT-2A) 5HT2A_HUMAN HTR2A | Serotonin receptor 2A
Type:
undefined
Mol. Mass.:
52607.65
Organism:
Homo sapiens (Human)
Description:
P28223
Residue:
471
  
Component 2
Name:
Metabotropic glutamate receptor 2
Synonyms:
GPRC1B GRM2_HUMAN Metabotropic glutamate receptor mGlu2 | metabotropic glutamate 2
Type:
Enzyme
Mol. Mass.:
95584.88
Organism:
Homo sapiens (Human)
Description:
Q14416
Residue:
872
  
Inhibitor
Name:
BDBM50544628
Synonyms:
CHEMBL4638006
Type:
Small organic molecule
Emp. Form.:
C22H26FNO3
Mol. Mass.:
371.4451
SMILES:
COc1cccc(C(=O)C2CCN(CCc3ccc(F)cc3)CC2)c1OC
: