Target
P2Y purinoceptor 1
Ligand
BDBM85043
Substrate
Meas. Tech.
ChEMBL_147891 (CHEMBL884926)
IC50
16600±n/a nM
Citation
 Kim, YCBrown, SGHarden, TKBoyer, JLDubyak, GKing, BFBurnstock, GJacobson, KA Structure-activity relationships of pyridoxal phosphate derivatives as potent and selective antagonists of P2X1 receptors. J Med Chem 44:340-9 (2001)  
Target
Name:
P2Y purinoceptor 1
Synonyms:
P2RY1 | P2RY1_MELGA
Type:
Mol. Mass.:
41199.64
Organism:
Meleagris gallopavo
Description:
Residue:
362
  
Inhibitor
Name:
BDBM85043
Synonyms:
CAS_149017-66-3 NSC_6093163 | PPADS
Type:
Small organic molecule
Emp. Form.:
C14H14N3O12PS2
Mol. Mass.:
511.378
SMILES:
Cc1nc(N=Nc2ccc(cc2S(O)(=O)=O)S(O)(=O)=O)c(COP(O)(O)=O)c(C=O)c1O
: