Target
P2X purinoceptor 3
Ligand
BDBM85043
Substrate
Meas. Tech.
ChEMBL_147552 (CHEMBL751122)
IC50
240±n/a nM
Citation
 Kim, YCBrown, SGHarden, TKBoyer, JLDubyak, GKing, BFBurnstock, GJacobson, KA Structure-activity relationships of pyridoxal phosphate derivatives as potent and selective antagonists of P2X1 receptors. J Med Chem 44:340-9 (2001)  
Target
Name:
P2X purinoceptor 3
Synonyms:
ATP receptor P2X purinoceptor 3 P2rx3 ratp2x3 | ratp2x3 + rsa
Type:
Enzyme Catalytic Domain
Mol. Mass.:
44397.63
Organism:
RAT
Description:
Purinergic, P2X3 0 RAT::P49654
Residue:
397
  
Inhibitor
Name:
BDBM85043
Synonyms:
CAS_149017-66-3 NSC_6093163 | PPADS
Type:
Small organic molecule
Emp. Form.:
C14H14N3O12PS2
Mol. Mass.:
511.378
SMILES:
Cc1nc(N=Nc2ccc(cc2S(O)(=O)=O)S(O)(=O)=O)c(COP(O)(O)=O)c(C=O)c1O
: