Target
P2X purinoceptor 1
Ligand
BDBM50102300
Substrate
Meas. Tech.
ChEMBL_147547 (CHEMBL754874)
IC50
12±n/a nM
Citation
 Kim, YCBrown, SGHarden, TKBoyer, JLDubyak, GKing, BFBurnstock, GJacobson, KA Structure-activity relationships of pyridoxal phosphate derivatives as potent and selective antagonists of P2X1 receptors. J Med Chem 44:340-9 (2001)  
Target
Name:
P2X purinoceptor 1
Synonyms:
ATP receptor P2X1 Purinergic receptor RP-2 protein
Type:
Enzyme Catalytic Domain
Mol. Mass.:
44969.95
Organism:
RAT
Description:
Purinergic, P2X1 0 RAT::P47824
Residue:
399
  
Inhibitor
Name:
BDBM50102300
Synonyms:
CHEMBL331250 | [4-(4-Formyl-5-hydroxy-6-methyl-3-phosphonomethyl-pyridin-2-ylazo)-phenyl]-phosphonic acid
Type:
Small organic molecule
Emp. Form.:
C14H15N3O8P2
Mol. Mass.:
415.2317
SMILES:
Cc1nc(N=Nc2ccc(cc2)P(O)(O)=O)c(CP(O)(O)=O)c(C=O)c1O
: