Target
P2X purinoceptor 4
Ligand
BDBM85043
Substrate
Meas. Tech.
ChEMBL_147554 (CHEMBL751124)
IC50
27500±n/a nM
Citation
 Kim, YCBrown, SGHarden, TKBoyer, JLDubyak, GKing, BFBurnstock, GJacobson, KA Structure-activity relationships of pyridoxal phosphate derivatives as potent and selective antagonists of P2X1 receptors. J Med Chem 44:340-9 (2001)  
Target
Name:
P2X purinoceptor 4
Synonyms:
ATP receptor P2RX4_HUMAN Purinergic receptor | Purinergic, P2X4
Type:
Enzyme Catalytic Domain
Mol. Mass.:
43374.70
Organism:
Homo sapiens (Human)
Description:
Purinergic, P2X4 0 HUMAN::Q99571
Residue:
388
  
Inhibitor
Name:
BDBM85043
Synonyms:
CAS_149017-66-3 NSC_6093163 | PPADS
Type:
Small organic molecule
Emp. Form.:
C14H14N3O12PS2
Mol. Mass.:
511.378
SMILES:
Cc1nc(N=Nc2ccc(cc2S(O)(=O)=O)S(O)(=O)=O)c(COP(O)(O)=O)c(C=O)c1O
: