Target
P2X purinoceptor
Ligand
BDBM85043
Substrate
Meas. Tech.
ChEMBL_147555 (CHEMBL751125)
IC50
21000±n/a nM
Citation
 Kim, YCBrown, SGHarden, TKBoyer, JLDubyak, GKing, BFBurnstock, GJacobson, KA Structure-activity relationships of pyridoxal phosphate derivatives as potent and selective antagonists of P2X1 receptors. J Med Chem 44:340-9 (2001)  
Target
Name:
P2X purinoceptor
Synonyms:
P2X purinoceptor 4
Type:
PROTEIN
Mol. Mass.:
43538.10
Organism:
Mus musculus
Description:
ChEMBL_147555
Residue:
388
  
Inhibitor
Name:
BDBM85043
Synonyms:
CAS_149017-66-3 NSC_6093163 | PPADS
Type:
Small organic molecule
Emp. Form.:
C14H14N3O12PS2
Mol. Mass.:
511.378
SMILES:
Cc1nc(N=Nc2ccc(cc2S(O)(=O)=O)S(O)(=O)=O)c(COP(O)(O)=O)c(C=O)c1O
: