Target
P2X purinoceptor 1
Ligand
BDBM50102297
Substrate
Meas. Tech.
ChEMBL_147547 (CHEMBL754874)
IC50
42±n/a nM
Citation
 Kim, YCBrown, SGHarden, TKBoyer, JLDubyak, GKing, BFBurnstock, GJacobson, KA Structure-activity relationships of pyridoxal phosphate derivatives as potent and selective antagonists of P2X1 receptors. J Med Chem 44:340-9 (2001)  
Target
Name:
P2X purinoceptor 1
Synonyms:
ATP receptor P2X1 Purinergic receptor RP-2 protein
Type:
Enzyme Catalytic Domain
Mol. Mass.:
44969.95
Organism:
RAT
Description:
Purinergic, P2X1 0 RAT::P47824
Residue:
399
  
Inhibitor
Name:
BDBM50102297
Synonyms:
CHEMBL118007 | [2-(3,5-Bis-phosphonomethyl-phenylazo)-4-formyl-5-hydroxy-6-methyl-pyridin-3-ylmethyl]-phosphonic acid
Type:
Small organic molecule
Emp. Form.:
C16H20N3O11P3
Mol. Mass.:
523.2648
SMILES:
Cc1nc(N=Nc2cc(CP(O)(O)=O)cc(CP(O)(O)=O)c2)c(CP(O)(O)=O)c(C=O)c1O
: