Target
P2X purinoceptor 1
Ligand
BDBM50102304
Substrate
Meas. Tech.
ChEMBL_147547 (CHEMBL754874)
IC50
42±n/a nM
Citation
 Kim, YCBrown, SGHarden, TKBoyer, JLDubyak, GKing, BFBurnstock, GJacobson, KA Structure-activity relationships of pyridoxal phosphate derivatives as potent and selective antagonists of P2X1 receptors. J Med Chem 44:340-9 (2001)  
Target
Name:
P2X purinoceptor 1
Synonyms:
ATP receptor P2X1 Purinergic receptor RP-2 protein
Type:
Enzyme Catalytic Domain
Mol. Mass.:
44969.95
Organism:
RAT
Description:
Purinergic, P2X1 0 RAT::P47824
Residue:
399
  
Inhibitor
Name:
BDBM50102304
Synonyms:
CHEMBL116926 | Phosphoric acid mono-(4-formyl-5-hydroxy-6-methyl-2-phenylazo-pyridin-3-ylmethyl) ester
Type:
Small organic molecule
Emp. Form.:
C14H14N3O6P
Mol. Mass.:
351.2512
SMILES:
Cc1nc(N=Nc2ccccc2)c(COP(O)(O)=O)c(C=O)c1O
: