Target
P2X purinoceptor 1
Ligand
BDBM50102301
Substrate
Meas. Tech.
ChEMBL_147547 (CHEMBL754874)
IC50
20±n/a nM
Citation
 Kim, YCBrown, SGHarden, TKBoyer, JLDubyak, GKing, BFBurnstock, GJacobson, KA Structure-activity relationships of pyridoxal phosphate derivatives as potent and selective antagonists of P2X1 receptors. J Med Chem 44:340-9 (2001)  
Target
Name:
P2X purinoceptor 1
Synonyms:
ATP receptor P2X1 Purinergic receptor RP-2 protein
Type:
Enzyme Catalytic Domain
Mol. Mass.:
44969.95
Organism:
RAT
Description:
Purinergic, P2X1 0 RAT::P47824
Residue:
399
  
Inhibitor
Name:
BDBM50102301
Synonyms:
4-[4-Formyl-5-hydroxy-6-methyl-3-(2-phosphono-ethyl)-pyridin-2-ylazo]-benzoic acid | CHEMBL117766
Type:
Small organic molecule
Emp. Form.:
C16H16N3O7P
Mol. Mass.:
393.2879
SMILES:
Cc1nc(N=Nc2ccc(cc2)C(O)=O)c(CCP(O)(O)=O)c(C=O)c1O
: