Target
Alpha-synuclein
Ligand
BDBM50545088
Substrate
Meas. Tech.
ChEMBL_1994333 (CHEMBL4628228)
Kd
8.2±n/a nM
Citation
 Chen, YFBian, JZhang, PBu, LLShen, YYu, WBLu, XHLin, XYe, DYWang, JChu, Y Design, synthesis and identification of N, N-dibenzylcinnamamide (DBC) derivatives as novel ligands for ?-synuclein fibrils by SPR evaluation system. Bioorg Med Chem 28:0 (2020)  
Target
Name:
Alpha-synuclein
Synonyms:
NACP SNCA | SYUA_HUMAN
Type:
Protein
Mol. Mass.:
14451.42
Organism:
Homo sapiens (Human)
Description:
P37840
Residue:
140
  
Inhibitor
Name:
BDBM50545088
Synonyms:
CHEMBL4633757
Type:
Small organic molecule
Emp. Form.:
C22H17N3O4
Mol. Mass.:
387.3881
SMILES:
[O-][N+](=O)c1ccccc1CN(Cc1ccco1)C(=O)\C=C\c1ccc(cc1)C#N
: