Target
Alpha-synuclein
Ligand
BDBM50545097
Substrate
Meas. Tech.
ChEMBL_1994333 (CHEMBL4628228)
Kd
11±n/a nM
Citation
 Chen, YFBian, JZhang, PBu, LLShen, YYu, WBLu, XHLin, XYe, DYWang, JChu, Y Design, synthesis and identification of N, N-dibenzylcinnamamide (DBC) derivatives as novel ligands for ?-synuclein fibrils by SPR evaluation system. Bioorg Med Chem 28:0 (2020)  
Target
Name:
Alpha-synuclein
Synonyms:
NACP SNCA | SYUA_HUMAN
Type:
Protein
Mol. Mass.:
14451.42
Organism:
Homo sapiens (Human)
Description:
P37840
Residue:
140
  
Inhibitor
Name:
BDBM50545097
Synonyms:
CHEMBL4634055
Type:
Small organic molecule
Emp. Form.:
C23H18F2N2O3
Mol. Mass.:
408.3974
SMILES:
[O-][N+](=O)c1ccc(F)cc1CN(Cc1ccccc1)C(=O)\C=C\c1ccc(F)cc1
: