Target
Adenosine receptor A3
Ligand
BDBM50094691
Substrate
Meas. Tech.
ChEMBL_32013 (CHEMBL646610)
Ki
0.2±n/a nM
Citation
 Baraldi, PGCacciari, BMoro, SRomagnoli, RJi Xd, naJacobson, KAGessi, SBorea, PASpalluto, G Fluorosulfonyl- and bis-(beta-chloroethyl)amino-phenylamino functionalized pyrazolo[4,3-e]1,2,4-triazolo[1,5-c]pyrimidine derivatives: irreversible antagonists at the human A3 adenosine receptor and molecular modeling studies. J Med Chem 44:2735-42 (2001)  
Target
Name:
Adenosine receptor A3
Synonyms:
A3 adenosine receptor (hA3) ADORA3 | Adenosine A3 receptor (A3AR)
Type:
G Protein-Coupled Receptor (GPCR)
Mol. Mass.:
36197.32
Organism:
Homo sapiens (Human)
Description:
P0DMS8
Residue:
318
  
Inhibitor
Name:
BDBM50094691
Synonyms:
1-(2-(furan-2-yl)-8-methyl-8H-pyrazolo[4,3-e][1,2,4]triazolo[1,5-c]pyrimidin-5-yl)-3-(4-methoxyphenyl)urea CHEMBL329791
Type:
Small organic molecule
Emp. Form.:
C19H16N8O3
Mol. Mass.:
404.3821
SMILES:
COc1ccc(NC(=O)Nc2nc3nn(C)cc3c3nc(nn23)-c2ccco2)cc1
: