Target
Beta-glucuronidase
Ligand
BDBM50008907
Substrate
Meas. Tech.
ChEMBL_1994482 (CHEMBL4628377)
IC50
48400±n/a nM
Citation
 Iraji, ANouri, AEdraki, NPirhadi, SKhoshneviszadeh, MKhoshneviszadeh, M One-pot synthesis of thioxo-tetrahydropyrimidine derivatives as potent ?-glucuronidase inhibitor, biological evaluation, molecular docking and molecular dynamics studies. Bioorg Med Chem 28:0 (2020)  
Target
Name:
Beta-glucuronidase
Synonyms:
β-Glucuronidase Beta-G1 GUSB | beta-Glucuronidase (β-glucuronidase)
Type:
Protein
Mol. Mass.:
74736.05
Organism:
Homo sapiens (Human)
Description:
Residue:
651
  
Inhibitor
Name:
BDBM50008907
Synonyms:
D-Saccharic Acid 1,4-Lactone
Type:
Small organic molecule
Emp. Form.:
C6H8O7
Mol. Mass.:
192.1235
SMILES:
[H][C@@]1(OC(=O)[C@H](O)[C@H]1O)[C@H](O)C(O)=O
: