Target
Beta-glucuronidase
Ligand
BDBM50545193
Substrate
Meas. Tech.
ChEMBL_1994482 (CHEMBL4628377)
IC50
720±n/a nM
Citation
 Iraji, ANouri, AEdraki, NPirhadi, SKhoshneviszadeh, MKhoshneviszadeh, M One-pot synthesis of thioxo-tetrahydropyrimidine derivatives as potent ?-glucuronidase inhibitor, biological evaluation, molecular docking and molecular dynamics studies. Bioorg Med Chem 28:0 (2020)  
Target
Name:
Beta-glucuronidase
Synonyms:
β-Glucuronidase Beta-G1 GUSB | beta-Glucuronidase (β-glucuronidase)
Type:
Protein
Mol. Mass.:
74736.05
Organism:
Homo sapiens (Human)
Description:
Residue:
651
  
Inhibitor
Name:
BDBM50545193
Synonyms:
CHEMBL4207146
Type:
Small organic molecule
Emp. Form.:
C16H21N3O2S
Mol. Mass.:
319.422
SMILES:
CCN(CC)C(=O)C1=C(C)NC(=S)NC1c1cccc(O)c1
: